BDBM50187967 CHEMBL379567::rac-9a-ethyl-6-methyl-9,9a-dihydroindeno[2,1-e]indazole-7,10(3H,8H)-dione
SMILES CCC12CCC(=O)C(C)=C1c1ccc3[nH]ncc3c1C2=O
InChI Key InChIKey=XKHMDMAEZZTPAZ-UHFFFAOYSA-N
Data  2 IC50
  Tab Delimited (TSV)   2D SDfile   Computed 3D by Vconf -m prep SDfile
Find this compound or compounds like it in BindingDB:
Activity Spreadsheet -- Enzyme Inhibition Constant Data from BindingDB
Found 2 hits for monomerid = 50187967
TargetEstrogen receptor(Homo sapiens (Human))
Merck Research Laboratories
Curated by ChEMBL
LigandPNGBDBM50187967(CHEMBL379567 | rac-9a-ethyl-6-methyl-9,9a-dihydroi...)
Affinity DataIC50:  624nM. Assay description: Binding affinity to human ERalpha
In DepthDetails ArticlePubMed
TargetEstrogen receptor beta(Homo sapiens (Human))
Merck Research Laboratories
Curated by ChEMBL
LigandPNGBDBM50187967(CHEMBL379567 | rac-9a-ethyl-6-methyl-9,9a-dihydroi...)
Affinity DataIC50:  31.8nM. Assay description: Binding affinity to human ERbeta
In DepthDetails ArticlePubMed