BDBM50187970 CHEMBL211837::rac-1-chloro-9a-ethyl-6-methyl-8,9,9a,10-tetrahydroindeno[2,1-e]indazol-7(3H)-one
SMILES CCC12Cc3c(ccc4[nH]nc(Cl)c34)C1=C(C)C(=O)CC2
InChI Key InChIKey=IJDXCHAXEHQCAZ-UHFFFAOYSA-N
Data  2 IC50
  Tab Delimited (TSV)   2D SDfile   Computed 3D by Vconf -m prep SDfile
Find this compound or compounds like it in BindingDB:
Activity Spreadsheet -- Enzyme Inhibition Constant Data from BindingDB
Found 2 hits for monomerid = 50187970
TargetEstrogen receptor(Homo sapiens (Human))
Merck Research Laboratories
Curated by ChEMBL
LigandPNGBDBM50187970(CHEMBL211837 | rac-1-chloro-9a-ethyl-6-methyl-8,9,...)
Affinity DataIC50:  2.42E+3nM. Assay description: Binding affinity to human ERalpha
In DepthDetails ArticlePubMed
TargetEstrogen receptor beta(Homo sapiens (Human))
Merck Research Laboratories
Curated by ChEMBL
LigandPNGBDBM50187970(CHEMBL211837 | rac-1-chloro-9a-ethyl-6-methyl-8,9,...)
Affinity DataIC50:  42.5nM. Assay description: Binding affinity to human ERbeta
In DepthDetails ArticlePubMed