BDBM50188677 4-(3-(trifluoromethoxy)phenyl)-6-(trifluoromethyl)-2-(4-(3-(trifluoromethyl)pyridin-2-yl)piperazin-1-yl)-1H-benzo[d]-imidazole::CHEMBL210263
SMILES FC(F)(F)Oc1cccc(c1)-c1cc(cc2[nH]c(nc12)N1CCN(CC1)c1ncccc1C(F)(F)F)C(F)(F)F
InChI Key InChIKey=XYBUBAWPEKATEM-UHFFFAOYSA-N
Data  2 IC50
  Tab Delimited (TSV)   2D SDfile   Computed 3D by Vconf -m prep SDfile
Find this compound or compounds like it in BindingDB:
Activity Spreadsheet -- Enzyme Inhibition Constant Data from BindingDB
Found 2 hits for monomerid = 50188677
TargetTransient receptor potential cation channel subfamily V member 1(Rattus norvegicus (rat))
Amgen
Curated by ChEMBL
LigandPNGBDBM50188677(4-(3-(trifluoromethoxy)phenyl)-6-(trifluoromethyl)...)
Affinity DataIC50:  26nM. Assay description: Antagonist activity against capsaicin-induced 45calcium ion uptake in CHO cells expressing rat TRPV1
In DepthDetails ArticlePubMed
TargetTransient receptor potential cation channel subfamily V member 1(Rattus norvegicus (rat))
Amgen
Curated by ChEMBL
LigandPNGBDBM50188677(4-(3-(trifluoromethoxy)phenyl)-6-(trifluoromethyl)...)
Affinity DataIC50:  21nM. Assay description: Antagonist activity against acid-induced 45calcium ion uptake in CHO cells expressing rat TRPV1 at pH5
In DepthDetails ArticlePubMed