BDBM50188685 (R)-N-(5-chloro-6-(4-(4-(4-fluorophenyl)-6-(trifluoromethyl)-1H-benzo[d]imidazol-2-yl)-3-methylpiperazin-1-yl)pyridin-3-yl)-2-hydroxyacetamide::CHEMBL378565
SMILES C[C@@H]1CN(CCN1c1nc2c(cc(cc2[nH]1)C(F)(F)F)-c1ccc(F)cc1)c1ncc(NC(=O)CO)cc1Cl
InChI Key InChIKey=FEHIRMWSAFWMRU-CQSZACIVSA-N
Data  2 IC50
  Tab Delimited (TSV)   2D SDfile   Computed 3D by Vconf -m prep SDfile
Find this compound or compounds like it in BindingDB:
Activity Spreadsheet -- Enzyme Inhibition Constant Data from BindingDB
Found 2 hits for monomerid = 50188685
TargetTransient receptor potential cation channel subfamily V member 1(Rattus norvegicus (rat))
Amgen
Curated by ChEMBL
LigandPNGBDBM50188685((R)-N-(5-chloro-6-(4-(4-(4-fluorophenyl)-6-(triflu...)
Affinity DataIC50:  9.20nM. Assay description: Antagonist activity against acid-induced 45calcium ion uptake in CHO cells expressing rat TRPV1 at pH5
In DepthDetails ArticlePubMed
TargetTransient receptor potential cation channel subfamily V member 1(Rattus norvegicus (rat))
Amgen
Curated by ChEMBL
LigandPNGBDBM50188685((R)-N-(5-chloro-6-(4-(4-(4-fluorophenyl)-6-(triflu...)
Affinity DataIC50:  30nM. Assay description: Antagonist activity against capsaicin-induced 45calcium ion uptake in CHO cells expressing rat TRPV1
In DepthDetails ArticlePubMed