BDBM50188712 (R)-2-(2-methyl-4-(3-(trifluoromethyl)pyridin-2-yl)piperazin-1-yl)-6-(trifluoromethyl)-1H-benzo[d]imidazole::CHEMBL208757
SMILES C[C@@H]1CN(CCN1c1nc2ccc(cc2[nH]1)C(F)(F)F)c1ncccc1C(F)(F)F
InChI Key InChIKey=OUYIEMLENYKDPH-LLVKDONJSA-N
Data  2 IC50
  Tab Delimited (TSV)   2D SDfile   Computed 3D by Vconf -m prep SDfile
Find this compound or compounds like it in BindingDB:
Activity Spreadsheet -- Enzyme Inhibition Constant Data from BindingDB
Found 2 hits for monomerid = 50188712
TargetTransient receptor potential cation channel subfamily V member 1(Rattus norvegicus (rat))
Amgen
Curated by ChEMBL
LigandPNGBDBM50188712((R)-2-(2-methyl-4-(3-(trifluoromethyl)pyridin-2-yl...)
Affinity DataIC50:  35nM. Assay description: Antagonist activity against acid-induced 45calcium ion uptake in CHO cells expressing rat TRPV1 at pH5
In DepthDetails ArticlePubMed
TargetTransient receptor potential cation channel subfamily V member 1(Rattus norvegicus (rat))
Amgen
Curated by ChEMBL
LigandPNGBDBM50188712((R)-2-(2-methyl-4-(3-(trifluoromethyl)pyridin-2-yl...)
Affinity DataIC50:  48nM. Assay description: Antagonist activity against capsaicin-induced 45calcium ion uptake in CHO cells expressing rat TRPV1
In DepthDetails ArticlePubMed