BDBM50188716 6-(trifluoromethyl)-4-(4-(trifluoromethyl)phenyl)-2-(4-(3-(trifluoromethyl)pyridin-2-yl)piperazin-1-yl)-1H-benzo[d]-imidazole::CHEMBL437304
SMILES FC(F)(F)c1ccc(cc1)-c1cc(cc2[nH]c(nc12)N1CCN(CC1)c1ncccc1C(F)(F)F)C(F)(F)F
InChI Key InChIKey=HNUQQTOMGPCNBP-UHFFFAOYSA-N
Data  2 IC50
  Tab Delimited (TSV)   2D SDfile   Computed 3D by Vconf -m prep SDfile
Find this compound or compounds like it in BindingDB:
Activity Spreadsheet -- Enzyme Inhibition Constant Data from BindingDB
Found 2 hits for monomerid = 50188716
TargetTransient receptor potential cation channel subfamily V member 1(Rattus norvegicus (rat))
Amgen
Curated by ChEMBL
LigandPNGBDBM50188716(6-(trifluoromethyl)-4-(4-(trifluoromethyl)phenyl)-...)
Affinity DataIC50:  37nM. Assay description: Antagonist activity against acid-induced 45calcium ion uptake in CHO cells expressing rat TRPV1 at pH5
In DepthDetails ArticlePubMed
TargetTransient receptor potential cation channel subfamily V member 1(Rattus norvegicus (rat))
Amgen
Curated by ChEMBL
LigandPNGBDBM50188716(6-(trifluoromethyl)-4-(4-(trifluoromethyl)phenyl)-...)
Affinity DataIC50:  51nM. Assay description: Antagonist activity against capsaicin-induced 45calcium ion uptake in CHO cells expressing rat TRPV1
In DepthDetails ArticlePubMed