BDBM50188717 (R)-(5-chloro-6-(4-(4-(dibenzylamino)-6-(trifluoromethyl)-1H-benzo[d]imidazol-2-yl)-3-methylpiperazin-1-yl)pyridin-3-yl)-methanol::CHEMBL379750
SMILES C[C@@H]1CN(CCN1c1nc2cc(cc(N(Cc3ccccc3)Cc3ccccc3)c2[nH]1)C(F)(F)F)c1ncc(CO)cc1Cl
InChI Key InChIKey=AUFLGFDRZBYTIH-JOCHJYFZSA-N
Data  2 IC50
  Tab Delimited (TSV)   2D SDfile   Computed 3D by Vconf -m prep SDfile
Find this compound or compounds like it in BindingDB:
Activity Spreadsheet -- Enzyme Inhibition Constant Data from BindingDB
Found 2 hits for monomerid = 50188717
TargetTransient receptor potential cation channel subfamily V member 1(Rattus norvegicus (rat))
Amgen
Curated by ChEMBL
LigandPNGBDBM50188717((R)-(5-chloro-6-(4-(4-(dibenzylamino)-6-(trifluoro...)
Affinity DataIC50:  0.900nM. Assay description: Antagonist activity against acid-induced 45calcium ion uptake in CHO cells expressing rat TRPV1 at pH5
In DepthDetails ArticlePubMed
TargetTransient receptor potential cation channel subfamily V member 1(Rattus norvegicus (rat))
Amgen
Curated by ChEMBL
LigandPNGBDBM50188717((R)-(5-chloro-6-(4-(4-(dibenzylamino)-6-(trifluoro...)
Affinity DataIC50:  1.90nM. Assay description: Antagonist activity against capsaicin-induced 45calcium ion uptake in CHO cells expressing rat TRPV1
In DepthDetails ArticlePubMed