BDBM50189940 (S)-2-hydroxy-N-[2'-hydroxy-3'-(1H-pyrrolo[3,2-c]pyridin-2-yl)-biphenyl-3-ylmethyl]-3-phenyl-propionamide::CHEMBL213180
SMILES O[C@@H](Cc1ccccc1)C(=O)NCc1cccc(c1)-c1cccc(-c2cc3cnccc3[nH]2)c1O
InChI Key InChIKey=XMQPNNNRKLSAJK-MHZLTWQESA-N
Data  3 KI
  Tab Delimited (TSV)   2D SDfile   Computed 3D by Vconf -m prep SDfile
Find this compound or compounds like it in BindingDB:
Activity Spreadsheet -- Enzyme Inhibition Constant Data from BindingDB
Found 3 hits for monomerid = 50189940
TargetCoagulation factor VII/Tissue factor(Homo sapiens (Human))
Celera Genomics
Curated by ChEMBL
LigandPNGBDBM50189940((S)-2-hydroxy-N-[2'-hydroxy-3'-(1H-pyrrolo[3,2-c]p...)
Affinity DataKi:  220nM. Assay description: Binding affinity to f7a/TF complex
In DepthDetails ArticlePubMed
TargetCoagulation factor X(Homo sapiens (Human))
Celera Genomics
Curated by ChEMBL
LigandPNGBDBM50189940((S)-2-hydroxy-N-[2'-hydroxy-3'-(1H-pyrrolo[3,2-c]p...)
Affinity DataKi:  3.00E+4nM. Assay description: Binding affinity to f10a
In DepthDetails ArticlePubMed
TargetProthrombin(Homo sapiens (Human))
Celera Genomics
Curated by ChEMBL
LigandPNGBDBM50189940((S)-2-hydroxy-N-[2'-hydroxy-3'-(1H-pyrrolo[3,2-c]p...)
Affinity DataKi:  1.00E+5nM. Assay description: Binding affinity to thrombin
In DepthDetails ArticlePubMed