BDBM50189954 2-(3,4-dimethylphenyl)-3-(2-(4-methoxycyclohexa-2,4-dienyl)ethyl)thiazolidin-4-one::CHEMBL445586
SMILES COC1=CCC(CCN2C(SCC2=O)c2ccc(C)c(C)c2)C=C1
InChI Key InChIKey=SDSADBCGGXETBG-UHFFFAOYSA-N
Data  1 IC50
  Tab Delimited (TSV)   2D SDfile   Computed 3D by Vconf -m prep SDfile
Find this compound or compounds like it in BindingDB:
Activity Spreadsheet -- Enzyme Inhibition Constant Data from BindingDB
Found 1 hit for monomerid = 50189954
TargetPotassium voltage-gated channel subfamily A member 5(Homo sapiens (Human))
Procter & Gamble Pharmaceuticals
Curated by ChEMBL
LigandPNGBDBM50189954(2-(3,4-dimethylphenyl)-3-(2-(4-methoxycyclohexa-2,...)
Affinity DataIC50:  137nM. Assay description: Blockade of Kv1.5 channel expressed in LTK cells by patch clamp method
In DepthDetails ArticlePubMed