BDBM50190487 CHEMBL212531::N-(3,5-diamino-6-chloropyrazine-2-carbony)-N'-{4-[4-(2(S)-2,3-dihydroxypropoxy)-phenyl]butyl}guanidine
SMILES NC(NC(=O)c1nc(Cl)c(N)nc1N)=NCCCCc1ccc(OC[C@@H](O)CO)cc1
InChI Key InChIKey=NTRKMGDUWYBLMS-LBPRGKRZSA-N
Data  1 IC50
  Tab Delimited (TSV)   2D SDfile   Computed 3D by Vconf -m prep SDfile
Find this compound or compounds like it in BindingDB:
Activity Spreadsheet -- Enzyme Inhibition Constant Data from BindingDB
Found 1 hit for monomerid = 50190487
TargetAmiloride-sensitive sodium channel subunit alpha(Homo sapiens (Human))
Parion Sciences
Curated by ChEMBL
LigandPNGBDBM50190487(CHEMBL212531 | N-(3,5-diamino-6-chloropyrazine-2-c...)
Affinity DataIC50:  7nM. Assay description: Inhibition of dog bronchi prototypical epithelial sodium channel by electrophysiological assay
In DepthDetails ArticlePubMed