BDBM50190495 CHEMBL209104::N-(3,5-diamino-6-chloropyrazine-2-carbonyl)-N'-[5-(4-methoxyphenyl)pentyl]-guanidine
SMILES COc1ccc(CCCCCN=C(N)NC(=O)c2nc(Cl)c(N)nc2N)cc1
InChI Key InChIKey=FKMGPZDWUWYQLF-UHFFFAOYSA-N
Data  1 IC50
  Tab Delimited (TSV)   2D SDfile   Computed 3D by Vconf -m prep SDfile
Find this compound or compounds like it in BindingDB:
Activity Spreadsheet -- Enzyme Inhibition Constant Data from BindingDB
Found 1 hit for monomerid = 50190495
TargetAmiloride-sensitive sodium channel subunit alpha(Homo sapiens (Human))
Parion Sciences
Curated by ChEMBL
LigandPNGBDBM50190495(CHEMBL209104 | N-(3,5-diamino-6-chloropyrazine-2-c...)
Affinity DataIC50:  77nM. Assay description: Inhibition of dog bronchi prototypical epithelial sodium channel by electrophysiological assay
In DepthDetails ArticlePubMed