BDBM50190734 CHEMBL3902295
SMILES Fc1ccc(Nc2ncnc3cc4oc(=O)n(CCOC(=O)CCl)c4cc23)cc1F
InChI Key InChIKey=CBBJKEWGUCYSAO-UHFFFAOYSA-N
Data  2 IC50
  Tab Delimited (TSV)   2D SDfile   Computed 3D by Vconf -m prep SDfile
Find this compound or compounds like it in BindingDB:
Activity Spreadsheet -- Enzyme Inhibition Constant Data from BindingDB
Found 2 hits for monomerid = 50190734
TargetReceptor tyrosine-protein kinase erbB-2(Homo sapiens (Human))
China Pharmaceutical University
Curated by ChEMBL
LigandPNGBDBM50190734(CHEMBL3902295)
Affinity DataIC50:  3.20E+3nM. Assay description: Inhibition of His-tagged human HER2 (676 to 1255 residues) expressed in baculovirus after 1 hr by Z-lyte assay
In DepthDetails ArticlePubMed
TargetEpidermal growth factor receptor(Homo sapiens (Human))
China Pharmaceutical University
Curated by ChEMBL
LigandPNGBDBM50190734(CHEMBL3902295)
Affinity DataIC50:  4.70E+3nM. Assay description: Inhibition of GST-tagged wild type recombinant human EGFR (668 to 1210 residues) expressed in baculovirus after 1 hr by Z-lyte assay
In DepthDetails ArticlePubMed