BDBM50190737 2-((1-((5-ethyl-1,3,4-thiadiazol-2-yl)carbamoyl)cyclopentyl)methyl)-4-phenylbutanoic acid::CHEMBL379065
SMILES CCc1nnc(NC(=O)C2(CC(CCc3ccccc3)C(O)=O)CCCC2)s1
InChI Key InChIKey=USJQBYSRQCMORE-UHFFFAOYSA-N
Data  2 IC50
  Tab Delimited (TSV)   2D SDfile   Computed 3D by Vconf -m prep SDfile
Find this compound or compounds like it in BindingDB:
Activity Spreadsheet -- Enzyme Inhibition Constant Data from BindingDB
Found 2 hits for monomerid = 50190737
TargetAcetylcholinesterase(Homo sapiens (Human))
Pfizer
Curated by ChEMBL
LigandPNGBDBM50190737(2-((1-((5-ethyl-1,3,4-thiadiazol-2-yl)carbamoyl)cy...)
Affinity DataIC50: >3.00E+3nM. Assay description: Inhibition of dog ACE
In DepthDetails ArticlePubMed
TargetNeprilysin(Homo sapiens (Human))
Pfizer
Curated by ChEMBL
LigandPNGBDBM50190737(2-((1-((5-ethyl-1,3,4-thiadiazol-2-yl)carbamoyl)cy...)
Affinity DataIC50:  46nM. Assay description: Inhibition of dog NEP
In DepthDetails ArticlePubMed