BDBM50190784 CHEMBL378496::N-[(3R)-1-azabicyclo[2.2.2]oct-3-yl]-2,3-dihydro-1-benzofubenzofuran-5-carboxamide
SMILES O=C(N[C@H]1CN2CCC1CC2)c1ccc2OCCc2c1
InChI Key InChIKey=YGTNJCNUBHRGNM-AWEZNQCLSA-N
Data  1 KI
  Tab Delimited (TSV)   2D SDfile   Computed 3D by Vconf -m prep SDfile
Find this compound or compounds like it in BindingDB:
Activity Spreadsheet -- Enzyme Inhibition Constant Data from BindingDB
Found 1 hit for monomerid = 50190784
TargetNeuronal acetylcholine receptor subunit alpha-7(Rattus norvegicus (Rat))
Pfizer
Curated by ChEMBL
LigandPNGBDBM50190784(CHEMBL378496 | N-[(3R)-1-azabicyclo[2.2.2]oct-3-yl...)
Affinity DataKi:  15nM. Assay description: Displacement of [3H]MLA from alpha7 nAChR in Sprague-Dawley rat brain homogenates
In DepthDetails ArticlePubMed