BDBM50190796 CHEMBL3910361
SMILES BrCC(=O)OCCn1c2cc3c(Nc4cccc(c4)C#C)ncnc3cc2oc1=O
InChI Key InChIKey=TZYIEAQKOJXMIB-UHFFFAOYSA-N
Data  1 IC50
  Tab Delimited (TSV)   2D SDfile   Computed 3D by Vconf -m prep SDfile
Find this compound or compounds like it in BindingDB:
Activity Spreadsheet -- Enzyme Inhibition Constant Data from BindingDB
Found 1 hit for monomerid = 50190796
TargetEpidermal growth factor receptor(Homo sapiens (Human))
China Pharmaceutical University
Curated by ChEMBL
LigandPNGBDBM50190796(CHEMBL3910361)
Affinity DataIC50:  5.20E+3nM. Assay description: Inhibition of GST-tagged wild type recombinant human EGFR (668 to 1210 residues) expressed in baculovirus after 1 hr by Z-lyte assay
In DepthDetails ArticlePubMed