BDBM50191328 CHEMBL3937487
SMILES O=C1C2OC(=NC2C(=O)c2ccccc12)c1ccccc1
InChI Key InChIKey=JMNKNUXYPDLLAL-UHFFFAOYSA-N
Data  1 IC50
  Tab Delimited (TSV)   2D SDfile   Computed 3D by Vconf -m prep SDfile
Find this compound or compounds like it in BindingDB:
Activity Spreadsheet -- Enzyme Inhibition Constant Data from BindingDB
Found 1 hit for monomerid = 50191328
TargetWD repeat-containing protein 48(Homo sapiens (Human))
University Of Connecticut Health Center
Curated by ChEMBL
LigandPNGBDBM50191328(CHEMBL3937487)
Affinity DataIC50:  540nM. Assay description: Inhibition of human USP1/UAF1 complex using Ub-Rho as substrate preincubated for 30 mins followed by substrate addition by fluorescence-based HTS ass...
In DepthDetails ArticlePubMed