BDBM50191645 CHEMBL3971413
SMILES CCOc1cc2ncnc(Nc3ccc4n(Cc5ccccc5)ncc4c3)c2cc1NC(=O)\C=C\CN1[C@@H](C)CNC[C@H]1C
InChI Key InChIKey=WJGBEIOIHHBCIV-RRSRKQOQSA-N
Data  4 IC50
  Tab Delimited (TSV)   2D SDfile   Computed 3D by Vconf -m prep SDfile
Find this compound or compounds like it in BindingDB:
Activity Spreadsheet -- Enzyme Inhibition Constant Data from BindingDB
Found 4 hits for monomerid = 50191645
TargetTyrosine-protein kinase JAK3(Homo sapiens (Human))
University Of Auckland
Curated by ChEMBL
LigandPNGBDBM50191645(CHEMBL3971413)
Affinity DataIC50:  8.88E+3nM. Assay description: Irreversible inhibition of human recombinant GST-tagged JAK3 expressed in baculovirus infected Sf9 insect cells assessed as reduction in polyglutamic...
In DepthDetails ArticlePubMed
TargetEpidermal growth factor receptor(Homo sapiens (Human))
University Of Auckland
Curated by ChEMBL
LigandPNGBDBM50191645(CHEMBL3971413)
Affinity DataIC50:  72nM. Assay description: Irreversible inhibition of GST-tagged ERBB1 (unknown origin) (Met-668 to Ala-1211 residues) expressed in baculovirus infected Sf9 insect cells assess...
In DepthDetails ArticlePubMed
TargetReceptor tyrosine-protein kinase erbB-2(Homo sapiens (Human))
University Of Auckland
Curated by ChEMBL
LigandPNGBDBM50191645(CHEMBL3971413)
Affinity DataIC50:  198nM. Assay description: Irreversible inhibition of GST-tagged ERBB2 (unknown origin) (Ile-675 to Val-1256 residues) expressed in baculovirus infected Sf9 insect cells assess...
In DepthDetails ArticlePubMed
TargetReceptor tyrosine-protein kinase erbB-4(Homo sapiens (Human))
University Of Auckland
Curated by ChEMBL
LigandPNGBDBM50191645(CHEMBL3971413)
Affinity DataIC50:  4nM. Assay description: Irreversible inhibition of GST-tagged ERBB4 (unknown origin) (Gly-259 to Gly-690 residues) expressed in baculovirus infected Sf9 insect cells assesse...
In DepthDetails ArticlePubMed