BDBM50191830 CHEMBL1761738
SMILES Oc1ccncc1N1C(=O)CS\C1=N/N=C1\C(=O)Nc2ccccc12
InChI Key InChIKey=WMSZLPKGUIIZIV-SILNSSARSA-N
Data  1 IC50
  Tab Delimited (TSV)   2D SDfile   Computed 3D by Vconf -m prep SDfile
Find this compound or compounds like it in BindingDB:
Activity Spreadsheet -- Enzyme Inhibition Constant Data from BindingDB
Found 1 hit for monomerid = 50191830
LigandPNGBDBM50191830(CHEMBL1761738)
Affinity DataIC50:  2.50E+4nM. Assay description: Competitive inhibition of recombinant TAK1-TAB1 assessed as [33P]gamma-ATP incorporation into substrate histone H1 peptide by filter plate assay
In DepthDetails ArticlePubMed