BDBM50192990 (S)-2-[4-(3-adamantan-1-yl-ureido)-butyrylamino]-3-(1H-indol-3-yl)-propionic acid::CHEMBL375135
SMILES OC(=O)[C@H](Cc1c[nH]c2ccccc12)NC(=O)CCCNC(=O)NC12CC3CC(CC(C3)C1)C2
InChI Key InChIKey=HYICMKSASAZTSW-ZYTNRUGMSA-N
Data  1 IC50
  Tab Delimited (TSV)   2D SDfile   Computed 3D by Vconf -m prep SDfile
Find this compound or compounds like it in BindingDB:
Activity Spreadsheet -- Enzyme Inhibition Constant Data from BindingDB
Found 1 hit for monomerid = 50192990
TargetBifunctional epoxide hydrolase 2(Mus musculus (Mouse))
University Of California
Curated by ChEMBL
LigandPNGBDBM50192990((S)-2-[4-(3-adamantan-1-yl-ureido)-butyrylamino]-3...)
Affinity DataIC50:  8.40E+3nM. Assay description: Inhibition of mouse recombinant soluble Epoxide hydrolase
In DepthDetails ArticlePubMed