BDBM50193742 1-(3-(trifluoromethyl)benzyl)-N-(2-(trifluoromethyl)phenylsulfonyl)-1H-indole-2-carboxamide::CHEMBL386307
SMILES FC(F)(F)c1cccc(Cn2c(cc3ccccc23)C(=O)NS(=O)(=O)c2ccccc2C(F)(F)F)c1
InChI Key InChIKey=RYZBTWSMNGDKFD-UHFFFAOYSA-N
Data  1 IC50
  Tab Delimited (TSV)   2D SDfile   Computed 3D by Vconf -m prep SDfile
Find this compound or compounds like it in BindingDB:
Activity Spreadsheet -- Enzyme Inhibition Constant Data from BindingDB
Found 1 hit for monomerid = 50193742
TargetPeroxisome proliferator-activated receptor gamma(Homo sapiens (Human))
Procter And Gamble Pharmaceuticals
Curated by ChEMBL
LigandPNGBDBM50193742(1-(3-(trifluoromethyl)benzyl)-N-(2-(trifluoromethy...)
Affinity DataIC50:  80nM. Assay description: Displacement of Fluormone from PPAR gamma
In DepthDetails ArticlePubMed