BDBM50194696 5-(2-aminoquinazolin-6-yl)-2-fluoro-N-(3-(trifluoromethyl)phenyl)benzamide::CHEMBL385477
SMILES Nc1ncc2cc(ccc2n1)-c1ccc(F)c(c1)C(=O)Nc1cccc(c1)C(F)(F)F
InChI Key InChIKey=UGZLMJATMYOPLB-UHFFFAOYSA-N
Data  1 IC50
  Tab Delimited (TSV)   2D SDfile   Computed 3D by Vconf -m prep SDfile
Find this compound or compounds like it in BindingDB:
Activity Spreadsheet -- Enzyme Inhibition Constant Data from BindingDB
Found 1 hit for monomerid = 50194696
TargetTyrosine-protein kinase Lck(Homo sapiens (Human))
Amgen
Curated by ChEMBL
LigandPNGBDBM50194696(5-(2-aminoquinazolin-6-yl)-2-fluoro-N-(3-(trifluor...)
Affinity DataIC50:  150nM. Assay description: Inhibition of Lck by HTRF kinase assay
In DepthDetails ArticlePubMed