BDBM50195503 4-amino-N-((1s,4s)-4-(benzylcarbamoyl)cyclohexyl)-3,5-dichloro-N-cyclopropylbenzamide::CHEMBL222510
SMILES Nc1c(Cl)cc(cc1Cl)C(=O)N(C1CC1)[C@H]1CC[C@H](CC1)C(=O)NCc1ccccc1
InChI Key InChIKey=JFHKVGDMKYWULR-MAEOIBBWSA-N
Data  2 KI  3 IC50
  Tab Delimited (TSV)   2D SDfile   Computed 3D by Vconf -m prep SDfile
Find this compound or compounds like it in BindingDB:
Activity Spreadsheet -- Enzyme Inhibition Constant Data from BindingDB
Found 5 hits for monomerid = 50195503
Target11-beta-hydroxysteroid dehydrogenase 1(Homo sapiens (Human))
Abbott Laboratories
Curated by ChEMBL
LigandPNGBDBM50195503(4-amino-N-((1s,4s)-4-(benzylcarbamoyl)cyclohexyl)-...)
Affinity DataKi:  17nM. Assay description: Inhibition of human 11beta-HSD1 expressed in Escherichia coli by SPA
In DepthDetails ArticlePubMed
Target11-beta-hydroxysteroid dehydrogenase 1(Rattus norvegicus (rat))
Abbott Laboratories
Curated by ChEMBL
LigandPNGBDBM50195503(4-amino-N-((1s,4s)-4-(benzylcarbamoyl)cyclohexyl)-...)
Affinity DataKi:  39nM. Assay description: Inhibition of rat 11beta-HSD1
In DepthDetails ArticlePubMed
Target11-beta-hydroxysteroid dehydrogenase type 2(Rattus norvegicus)
Abbott Laboratories
Curated by ChEMBL
LigandPNGBDBM50195503(4-amino-N-((1s,4s)-4-(benzylcarbamoyl)cyclohexyl)-...)
Affinity DataIC50: >1.00E+4nM. Assay description: Inhibition of rat 11beta-HSD2
In DepthDetails ArticlePubMed
Target11-beta-hydroxysteroid dehydrogenase type 2(Homo sapiens (Human))
Abbott Laboratories
Curated by ChEMBL
LigandPNGBDBM50195503(4-amino-N-((1s,4s)-4-(benzylcarbamoyl)cyclohexyl)-...)
Affinity DataIC50: >1.00E+4nM. Assay description: Inhibition of human 11beta-HSD2 by SPA
In DepthDetails ArticlePubMed
Target11-beta-hydroxysteroid dehydrogenase 1(Homo sapiens (Human))
Abbott Laboratories
Curated by ChEMBL
LigandPNGBDBM50195503(4-amino-N-((1s,4s)-4-(benzylcarbamoyl)cyclohexyl)-...)
Affinity DataIC50:  640nM. Assay description: Inhibition of human 11beta-HSD1 expressed in HEK293 cells by fluorescence polarization immuno-assay
In DepthDetails ArticlePubMed