BDBM50196031 CHEMBL216213::N-[(2-Tert-butyl-benzenesulfonyl)-phenyl]-2,3,4-trimethoxyl-5-(2-isopropyl-benzyl)-benzamide
SMILES COc1c(Cc2ccccc2C(C)C)cc(C(=O)Nc2ccc(cc2)S(=O)(=O)c2ccccc2C(C)(C)C)c(OC)c1OC
InChI Key InChIKey=PYRLGOIPDCITMO-UHFFFAOYSA-N
Data  1 KI  1 IC50
  Tab Delimited (TSV)   2D SDfile   Computed 3D by Vconf -m prep SDfile
Find this compound or compounds like it in BindingDB:
Activity Spreadsheet -- Enzyme Inhibition Constant Data from BindingDB
Found 2 hits for monomerid = 50196031
TargetApoptosis regulator Bcl-2(Homo sapiens (Human))
University Of Michigan
Curated by ChEMBL
LigandPNGBDBM50196031(CHEMBL216213 | N-[(2-Tert-butyl-benzenesulfonyl)-p...)
Affinity DataKi:  2.50E+4nM. Assay description: Displacement of FAM-Bid from human Bcl2 by FP assay
In DepthDetails ArticlePubMed
TargetApoptosis regulator Bcl-2(Homo sapiens (Human))
University Of Michigan
Curated by ChEMBL
LigandPNGBDBM50196031(CHEMBL216213 | N-[(2-Tert-butyl-benzenesulfonyl)-p...)
Affinity DataIC50: >1.00E+5nM. Assay description: Inhibition of growth of human PC3 cell overexpressing Bcl2
In DepthDetails ArticlePubMed