BDBM50197401 2-methyl-2-phenoxy-N-(5-sulfamoyl-adamantan-2-yl)-propionamide::CHEMBL241719
SMILES CC(C)(Oc1ccccc1)C(=O)N[C@H]1C2CC3CC1C[C@](C3)(C2)S(N)(=O)=O
InChI Key InChIKey=RJFGXRMIXRFUOJ-UMTQXKRCSA-N
Data  2 KI  3 IC50
  Tab Delimited (TSV)   2D SDfile   Computed 3D by Vconf -m prep SDfile
Find this compound or compounds like it in BindingDB:
Activity Spreadsheet -- Enzyme Inhibition Constant Data from BindingDB
Found 5 hits for monomerid = 50197401
Target11-beta-hydroxysteroid dehydrogenase 1(Mus musculus (mouse))
Abbott Laboratories
Curated by ChEMBL
LigandPNGBDBM50197401(2-methyl-2-phenoxy-N-(5-sulfamoyl-adamantan-2-yl)-...)
Affinity DataKi:  13nM. Assay description: Inhibition of mouse HSD1 assessed as interconversion of cortisone to cortisol
In DepthDetails ArticlePubMed
Target11-beta-hydroxysteroid dehydrogenase 1(Homo sapiens (Human))
Abbott Laboratories
Curated by ChEMBL
LigandPNGBDBM50197401(2-methyl-2-phenoxy-N-(5-sulfamoyl-adamantan-2-yl)-...)
Affinity DataKi:  21nM. Assay description: Inhibition of human HSD1 assessed as interconversion of cortisone to cortisol
In DepthDetails ArticlePubMed
Target11-beta-hydroxysteroid dehydrogenase type 2(Homo sapiens (Human))
Abbott Laboratories
Curated by ChEMBL
LigandPNGBDBM50197401(2-methyl-2-phenoxy-N-(5-sulfamoyl-adamantan-2-yl)-...)
Affinity DataIC50:  5.90E+4nM. Assay description: Inhibition of human HSD2 assessed as interconversion of cortisone to cortisol
In DepthDetails ArticlePubMed
Target11-beta-hydroxysteroid dehydrogenase 1(Homo sapiens (Human))
Abbott Laboratories
Curated by ChEMBL
LigandPNGBDBM50197401(2-methyl-2-phenoxy-N-(5-sulfamoyl-adamantan-2-yl)-...)
Affinity DataIC50:  580nM. Assay description: Inhibition of human HSD1 expressed in HEK cells
In DepthDetails ArticlePubMed
Target11-beta-hydroxysteroid dehydrogenase type 2(Mus musculus (mouse))
Abbott Laboratories
Curated by ChEMBL
LigandPNGBDBM50197401(2-methyl-2-phenoxy-N-(5-sulfamoyl-adamantan-2-yl)-...)
Affinity DataIC50: >1.00E+5nM. Assay description: Inhibition of mouse HSD2 assessed as interconversion of cortisone to cortisol
In DepthDetails ArticlePubMed