BDBM50198055 (R/S)-3-(6-Methoxynaphthalen-2-yl)-N,N-dimethylbutan-1-amine::(R/S)-N,N-dimethyl-3-(6-methoxy-naphthalen-2-yl) butan-1-amine::CHEMBL223337
SMILES COc1ccc2cc(ccc2c1)C(C)CCN(C)C
InChI Key InChIKey=IPRMMOIYEIKARW-UHFFFAOYSA-N
Data  2 KI
  Tab Delimited (TSV)   2D SDfile   Computed 3D by Vconf -m prep SDfile
Find this compound or compounds like it in BindingDB:
Activity Spreadsheet -- Enzyme Inhibition Constant Data from BindingDB
Found 2 hits for monomerid = 50198055
TargetSigma non-opioid intracellular receptor 1(Cavia porcellus (Guinea pig))
Università
Curated by ChEMBL
LigandPNGBDBM50198055((R/S)-3-(6-Methoxynaphthalen-2-yl)-N,N-dimethylbut...)
Affinity DataKi:  2.30nM. Assay description: Displacement of [3H]-(+)-pentazocine from sigma 1 receptor in guinea pig brain membrane
In DepthDetails ArticlePubMed
TargetSigma non-opioid intracellular receptor 1(RAT)
University Of Pavia
Curated by ChEMBL
LigandPNGBDBM50198055((R/S)-3-(6-Methoxynaphthalen-2-yl)-N,N-dimethylbut...)
Affinity DataKi:  14.4nM. Assay description: Displacement of [3H]-(+)-pentazocine from sigma 1 opioid receptor in rat liver homogenate
In DepthDetails ArticlePubMed