BDBM50198057 (R/S)-4-(dimethylamino)-2-(naphthalen-2-yl)butan-2-ol::CHEMBL376808
SMILES CN(C)CCCC(C)(O)c1ccc2ccccc2c1
InChI Key InChIKey=XQPSGEUAMVIMLF-UHFFFAOYSA-N
Data  1 KI
  Tab Delimited (TSV)   2D SDfile   Computed 3D by Vconf -m prep SDfile
Find this compound or compounds like it in BindingDB:
Activity Spreadsheet -- Enzyme Inhibition Constant Data from BindingDB
Found 1 hit for monomerid = 50198057
TargetSigma non-opioid intracellular receptor 1(Cavia porcellus (Guinea pig))
Università
Curated by ChEMBL
LigandPNGBDBM50198057((R/S)-4-(dimethylamino)-2-(naphthalen-2-yl)butan-2...)
Affinity DataKi:  25nM. Assay description: Displacement of [3H]-(+)-pentazocine from sigma 1 receptor in guinea pig brain membrane
In DepthDetails ArticlePubMed