BDBM50198064 CHEMBL224855::N,N-dimethyl-3-(naphthalen-2-yl)butan-1-amine
SMILES CC(CCN(C)C)c1ccc2ccccc2c1
InChI Key InChIKey=BNGSHTBTTWQXLD-UHFFFAOYSA-N
Data  2 KI
  Tab Delimited (TSV)   2D SDfile   Computed 3D by Vconf -m prep SDfile
Find this compound or compounds like it in BindingDB:
Activity Spreadsheet -- Enzyme Inhibition Constant Data from BindingDB
Found 2 hits for monomerid = 50198064
TargetSigma non-opioid intracellular receptor 1(Cavia porcellus (Guinea pig))
Università
Curated by ChEMBL
LigandPNGBDBM50198064(CHEMBL224855 | N,N-dimethyl-3-(naphthalen-2-yl)but...)
Affinity DataKi:  1.95nM. Assay description: Displacement of [3H]-(+)-pentazocine from sigma 1 receptor in guinea pig brain membrane
In DepthDetails ArticlePubMed
TargetSigma non-opioid intracellular receptor 1(Cavia porcellus (Guinea pig))
Università
Curated by ChEMBL
LigandPNGBDBM50198064(CHEMBL224855 | N,N-dimethyl-3-(naphthalen-2-yl)but...)
Affinity DataKi:  2nM. Assay description: Displacement of [3H]-(+)-pentazocine from sigma 1 receptor in guinea pig cerebral cortex membranes after 120 mins by scintillation counting analysis
In DepthDetails ArticlePubMed