BDBM50198249 2-(3,4-dimethylphenyl)-3-(4-methoxybenzyloxy)thiazolidin-4-one::CHEMBL386802
SMILES COc1ccc(CON2C(SCC2=O)c2ccc(C)c(C)c2)cc1
InChI Key InChIKey=NROGBECHHOOJMM-UHFFFAOYSA-N
Data  1 IC50
  Tab Delimited (TSV)   2D SDfile   Computed 3D by Vconf -m prep SDfile
Find this compound or compounds like it in BindingDB:
Activity Spreadsheet -- Enzyme Inhibition Constant Data from BindingDB
Found 1 hit for monomerid = 50198249
TargetPotassium voltage-gated channel subfamily A member 5(Homo sapiens (Human))
Procter And Gamble Pharmaceuticals
Curated by ChEMBL
LigandPNGBDBM50198249(2-(3,4-dimethylphenyl)-3-(4-methoxybenzyloxy)thiaz...)
Affinity DataIC50:  95nM. Assay description: Inhibition of Kv1.5 mediated ultra-rapid delayed rectifier current Ikur in human atrial cells
In DepthDetails ArticlePubMed