BDBM50198256 2-(4-chlorophenyl)-3-(4-methoxybenzyloxy)thiazolidin-4-one::CHEMBL218185
SMILES COc1ccc(CON2C(SCC2=O)c2ccc(Cl)cc2)cc1
InChI Key InChIKey=HVCRJNNBBJXFPY-UHFFFAOYSA-N
Data  1 IC50
  Tab Delimited (TSV)   2D SDfile   Computed 3D by Vconf -m prep SDfile
Find this compound or compounds like it in BindingDB:
Activity Spreadsheet -- Enzyme Inhibition Constant Data from BindingDB
Found 1 hit for monomerid = 50198256
TargetPotassium voltage-gated channel subfamily A member 5(Homo sapiens (Human))
Procter And Gamble Pharmaceuticals
Curated by ChEMBL
LigandPNGBDBM50198256(2-(4-chlorophenyl)-3-(4-methoxybenzyloxy)thiazolid...)
Affinity DataIC50:  187nM. Assay description: Inhibition of Kv1.5 mediated ultra-rapid delayed rectifier current Ikur in human atrial cells
In DepthDetails ArticlePubMed