BDBM50198260 1-(2-(3,4-dimethylphenyl)thiazolidin-3-yl)-2-phenoxyethanone::CHEMBL217372
SMILES Cc1ccc(cc1C)C1SCCN1C(=O)COc1ccccc1
InChI Key InChIKey=CVJWPKIGDLZJDR-UHFFFAOYSA-N
Data  1 IC50
  Tab Delimited (TSV)   2D SDfile   Computed 3D by Vconf -m prep SDfile
Find this compound or compounds like it in BindingDB:
Activity Spreadsheet -- Enzyme Inhibition Constant Data from BindingDB
Found 1 hit for monomerid = 50198260
TargetPotassium voltage-gated channel subfamily A member 5(Homo sapiens (Human))
Procter And Gamble Pharmaceuticals
Curated by ChEMBL
LigandPNGBDBM50198260(1-(2-(3,4-dimethylphenyl)thiazolidin-3-yl)-2-pheno...)
Affinity DataIC50:  162nM. Assay description: Inhibition of Kv1.5 mediated ultra-rapid delayed rectifier current Ikur in human atrial cells
In DepthDetails ArticlePubMed