BDBM50198832 CHEMBL227530::[3-amino-3-(4-octylphenylcarbamoyl)propyl]-phosphonic acid
SMILES CCCCCCCCc1ccc(NC(=O)[C@@H](N)CCP(O)(O)=O)cc1
InChI Key InChIKey=CSAPJUDXEBTDJR-KRWDZBQOSA-N
Data  2 EC50
  Tab Delimited (TSV)   2D SDfile   Computed 3D by Vconf -m prep SDfile
Find this compound or compounds like it in BindingDB:
Activity Spreadsheet -- Enzyme Inhibition Constant Data from BindingDB
Found 2 hits for monomerid = 50198832
TargetSphingosine 1-phosphate receptor 3(Homo sapiens (Human))
University Of Virginia
Curated by ChEMBL
LigandPNGBDBM50198832(CHEMBL227530 | [3-amino-3-(4-octylphenylcarbamoyl)...)
Affinity DataEC50:  1.50E+4nM. Assay description: Activity at human S1P3 receptor expressed in HEK293T cells by [35S]GTPgammaS binding assay
In DepthDetails ArticlePubMed
TargetSphingosine 1-phosphate receptor 1(Homo sapiens (Human))
University Of Virginia
Curated by ChEMBL
LigandPNGBDBM50198832(CHEMBL227530 | [3-amino-3-(4-octylphenylcarbamoyl)...)
Affinity DataEC50:  1.20E+3nM. Assay description: Activity at human S1P1 receptor expressed in HEK293T cells by [35S]GTPgammaS binding assay
In DepthDetails ArticlePubMed