BDBM50199510 CHEMBL3952356
SMILES Cc1ccsc1-c1cc(=O)c2ccccc2[nH]1
InChI Key InChIKey=GDTXKKCTRYYBMN-UHFFFAOYSA-N
Data  1 KI
  Tab Delimited (TSV)   2D SDfile   Computed 3D by Vconf -m prep SDfile
Find this compound or compounds like it in BindingDB:
Activity Spreadsheet -- Enzyme Inhibition Constant Data from BindingDB
Found 1 hit for monomerid = 50199510
TargetShiga toxin subunit A(Shigella dysenteriae)
TBA
Curated by ChEMBL
LigandPNGBDBM50199510(CHEMBL3952356)
Affinity DataKi:  1.33E+4nM. Assay description: Inhibition of Shigella dysenteriae type 1 Shiga toxin A subunit assessed as change in transition temperature by SYPRO orange dye based fluorescence-b...
In DepthDetails ArticlePubMed