BDBM50200311 (S)-1-(4-(2-bromoethoxy)benzyl)-5-[1-(2-methoxymethylpyrrolidinyl)sulfonyl]isatin::CHEMBL216447
SMILES COC[C@@H]1CCCN1S(=O)(=O)c1ccc2N(Cc3ccc(OCCBr)cc3)C(=O)C(=O)c2c1
InChI Key InChIKey=CXJCEKSGEFHWMX-KRWDZBQOSA-N
Data  1 KI  5 IC50
  Tab Delimited (TSV)   2D SDfile   Computed 3D by Vconf -m prep SDfile
Find this compound or compounds like it in BindingDB:
Activity Spreadsheet -- Enzyme Inhibition Constant Data from BindingDB
Found 6 hits for monomerid = 50200311
TargetCaspase-3(Homo sapiens (Human))
University Hospital Of The WestfäLische Wilhelms-UniversitäT
Curated by ChEMBL
LigandPNGBDBM50200311((S)-1-(4-(2-bromoethoxy)benzyl)-5-[1-(2-methoxymet...)
Affinity DataKi:  8nM. Assay description: Binding affinity to human caspase 3
In DepthDetails ArticlePubMed
TargetCaspase-8(Homo sapiens (Human))
University Hospital Of The WestfäLische Wilhelms-UniversitäT
Curated by ChEMBL
LigandPNGBDBM50200311((S)-1-(4-(2-bromoethoxy)benzyl)-5-[1-(2-methoxymet...)
Affinity DataIC50: >5.00E+5nM. Assay description: Inhibition of caspase 8
In DepthDetails ArticlePubMed
TargetCaspase-7(Homo sapiens (Human))
University Hospital Of The WestfäLische Wilhelms-UniversitäT
Curated by ChEMBL
LigandPNGBDBM50200311((S)-1-(4-(2-bromoethoxy)benzyl)-5-[1-(2-methoxymet...)
Affinity DataIC50:  25.7nM. Assay description: Inhibition of caspase 7
In DepthDetails ArticlePubMed
TargetCaspase-3(Homo sapiens (Human))
University Hospital Of The WestfäLische Wilhelms-UniversitäT
Curated by ChEMBL
LigandPNGBDBM50200311((S)-1-(4-(2-bromoethoxy)benzyl)-5-[1-(2-methoxymet...)
Affinity DataIC50:  16.3nM. Assay description: Inhibition of caspase 3
In DepthDetails ArticlePubMed
TargetCaspase-1(Homo sapiens (Human))
University Hospital Of The WestfäLische Wilhelms-UniversitäT
Curated by ChEMBL
LigandPNGBDBM50200311((S)-1-(4-(2-bromoethoxy)benzyl)-5-[1-(2-methoxymet...)
Affinity DataIC50: >1.50E+4nM. Assay description: Inhibition of caspase 1
In DepthDetails ArticlePubMed
TargetCaspase-6(Homo sapiens (Human))
University Hospital Of The WestfäLische Wilhelms-UniversitäT
Curated by ChEMBL
LigandPNGBDBM50200311((S)-1-(4-(2-bromoethoxy)benzyl)-5-[1-(2-methoxymet...)
Affinity DataIC50: >5.00E+5nM. Assay description: Inhibition of caspase 6
In DepthDetails ArticlePubMed