BDBM50200559 CHEMBL3922004::US9518026, Example 94::US9956214, Compound 1628
SMILES CCOc1ccc2cc(cnc2c1)-c1nn(C(C)C(C)C)c(N)c1C(N)=O
InChI Key InChIKey=MXVDOTDIJVYNLE-UHFFFAOYSA-N
Data  5 IC50
  Tab Delimited (TSV)   2D SDfile   Computed 3D by Vconf -m prep SDfile
Find this compound or compounds like it in BindingDB:
Activity Spreadsheet -- Enzyme Inhibition Constant Data from BindingDB
Found 5 hits for monomerid = 50200559
TargetCalmodulin-domain protein kinase 1(Toxoplasma gondii)
University Of Washington
Curated by ChEMBL
LigandPNGBDBM50200559(CHEMBL3922004 | US9518026, Example 94 | US9956214,...)
Affinity DataIC50:  18nM. Assay description: Inhibition of recombinant Toxoplasma gondii CDPK1 using Syntide 2 as substrate assessed as decrease in depletion of ATP after 90 mins by Kinase glo l...
In DepthDetails ArticlePubMed
TargetCalmodulin-domain protein kinase 1(Toxoplasma gondii)
University Of Washington
Curated by ChEMBL
LigandPNGBDBM50200559(CHEMBL3922004 | US9518026, Example 94 | US9956214,...)
Affinity DataIC50:  30nM. Assay description: Inhibition of TgCDPK1 and CpCDPK1 was determined using a luminescent kinase assay which measures ATP depletion in the presence of the Syntide 2 pepti...
In DepthDetails US Patent
TargetCalcium-dependent protein kinase 1(Cryptosporidium parvum)
University of Washington Through Its Center For Commercialization
US Patent
LigandPNGBDBM50200559(CHEMBL3922004 | US9518026, Example 94 | US9956214,...)
Affinity DataIC50:  5nM. Assay description: Inhibition of TgCDPK1 and CpCDPK1 was determined using a luminescent kinase assay which measures ATP depletion in the presence of the Syntide 2 pepti...
In DepthDetails US Patent
TargetCalmodulin-domain protein kinase 1(Toxoplasma gondii)
University Of Washington
Curated by ChEMBL
LigandPNGBDBM50200559(CHEMBL3922004 | US9518026, Example 94 | US9956214,...)
Affinity DataIC50:  11nM. Assay description: Inhibition of TgCDPK1 and CpCDPK1 was determined using a luminescent kinase assay which measures ATP depletion in the presence of the Syntide 2 pepti...
In DepthDetails US Patent
TargetUncharacterized protein(Cryptosporidium parvum)
University of Washington Through Its Center For Commercialization
US Patent
LigandPNGBDBM50200559(CHEMBL3922004 | US9518026, Example 94 | US9956214,...)
Affinity DataIC50:  13nM. Assay description: Inhibition of TgCDPK1 and CpCDPK1 was determined using a luminescent kinase assay which measures ATP depletion in the presence of the Syntide 2 pepti...
In DepthDetails US Patent