BDBM50203747 CHEMBL3978250
SMILES COc1cccc(c1)C(=O)N1CCC(F)(F)C(C1)Oc1ccc2ccccc2n1
InChI Key InChIKey=QZXSVMSMRJTFPZ-UHFFFAOYSA-N
Data  1 KI
  Tab Delimited (TSV)   2D SDfile   Computed 3D by Vconf -m prep SDfile
Find this compound or compounds like it in BindingDB:
Activity Spreadsheet -- Enzyme Inhibition Constant Data from BindingDB
Found 1 hit for monomerid = 50203747
TargetOrexin receptor type 2(Homo sapiens (Human))
Merck Research Laboratories
Curated by ChEMBL
LigandPNGBDBM50203747(CHEMBL3978250)
Affinity DataKi: >4.38E+3nM. Assay description: Displacement of (2S)-N-(2-pyrrol-1-ylphenyl)-1-[2-[1-(tritritiomethyl)benzimidazol-2-yl]sulfanylacetyl]pyrrolidine-2-carboxamide from human OX2 recep...
In DepthDetails ArticlePubMed