BDBM50203755 CHEMBL3900658
SMILES FC1(F)CCN(CC1Oc1ccc2ccccc2n1)C(=O)c1cccc2ncccc12
InChI Key InChIKey=IEVLPXBKOPAHHL-UHFFFAOYSA-N
Data  1 KI
  Tab Delimited (TSV)   2D SDfile   Computed 3D by Vconf -m prep SDfile
Find this compound or compounds like it in BindingDB:
Activity Spreadsheet -- Enzyme Inhibition Constant Data from BindingDB
Found 1 hit for monomerid = 50203755
TargetOrexin receptor type 2(Homo sapiens (Human))
Merck Research Laboratories
Curated by ChEMBL
LigandPNGBDBM50203755(CHEMBL3900658)
Affinity DataKi:  861nM. Assay description: Displacement of (2S)-N-(2-pyrrol-1-ylphenyl)-1-[2-[1-(tritritiomethyl)benzimidazol-2-yl]sulfanylacetyl]pyrrolidine-2-carboxamide from human OX2 recep...
In DepthDetails ArticlePubMed