BDBM50204020 CHEMBL3927519
SMILES CC#C[C@@H](CC(O)=O)c1ccc(OCc2ccc3nc(nn3c2)-c2c(C)cccc2C)cc1
InChI Key InChIKey=FDIWCHYTKOPHPS-QFIPXVFZSA-N
Data  1 KI  3 IC50  4 EC50
  Tab Delimited (TSV)   2D SDfile   Computed 3D by Vconf -m prep SDfile
Find this compound or compounds like it in BindingDB:
Activity Spreadsheet -- Enzyme Inhibition Constant Data from BindingDB
Found 8 hits for monomerid = 50204020
TargetFree fatty acid receptor 1(Homo sapiens (Human))
Eli Lilly
Curated by ChEMBL
LigandPNGBDBM50204020(CHEMBL3927519)
Affinity DataKi:  15nM. Assay description: Competitive displacement of [3H]-TAK-875 from full length human recombinant GPR40 expressed in HEK293 cell membranes after 2 hrs by scintillation cou...
In DepthDetails ArticlePubMed
TargetMelanocortin receptor 4(Rattus norvegicus)
Eli Lilly
Curated by ChEMBL
LigandPNGBDBM50204020(CHEMBL3927519)
Affinity DataEC50:  14nM. Assay description: Agonist activity at rat PK-tagged GPR40 expressed in human U2OS cells assessed as EA-tagged beta-arrestin recruitment after 90 mins in presence of 1 ...
In DepthDetails ArticlePubMed
TargetFree fatty acid receptor 1(Homo sapiens (Human))
Eli Lilly
Curated by ChEMBL
LigandPNGBDBM50204020(CHEMBL3927519)
Affinity DataEC50:  108nM. Assay description: Agonist activity at human PK-tagged GPR40 expressed in HEK293 cells assessed as EA-tagged beta-arrestin recruitment after 90 mins in presence of 1 % ...
In DepthDetails ArticlePubMed
TargetCytochrome P450 2D6(Homo sapiens (Human))
Eli Lilly
Curated by ChEMBL
LigandPNGBDBM50204020(CHEMBL3927519)
Affinity DataIC50: >6.00E+4nM. Assay description: Inhibition of human CYP2D6
In DepthDetails ArticlePubMed
TargetCytochrome P450 2C9(Homo sapiens (Human))
Eli Lilly
Curated by ChEMBL
LigandPNGBDBM50204020(CHEMBL3927519)
Affinity DataIC50: >6.00E+4nM. Assay description: Inhibition of human CYP2C9
In DepthDetails ArticlePubMed
TargetCytochrome P450 3A4(Homo sapiens (Human))
Eli Lilly
Curated by ChEMBL
LigandPNGBDBM50204020(CHEMBL3927519)
Affinity DataIC50: >6.00E+4nM. Assay description: Inhibition of human CYP3A4
In DepthDetails ArticlePubMed
TargetFree fatty acid receptor 1(Homo sapiens (Human))
Eli Lilly
Curated by ChEMBL
LigandPNGBDBM50204020(CHEMBL3927519)
Affinity DataEC50:  119nM. Assay description: Agonist activity at human GPR40 expressed in HEK293 cells assessed as increase in intracellular Ca2+ flux by calcium-4 dye based FLIPR assay
In DepthDetails ArticlePubMed
TargetFree fatty acid receptor 1(Homo sapiens (Human))
Eli Lilly
Curated by ChEMBL
LigandPNGBDBM50204020(CHEMBL3927519)
Affinity DataEC50:  11nM. Assay description: Agonist activity at human GPR40 receptor expressed in HEK293 cells assessed as increase in intracellular calcium flux after 2.5 hrs measured over 3 m...
In DepthDetails ArticlePubMed