BDBM50204145 (S)-5-((morpholin-2-ylmethoxy)methyl)-N-(1-(pyridin-2-ylmethyl)-1H-indazol-5-yl)pyrrolo[1,2-f][1,2,4]triazin-4-amine::CHEMBL396079
SMILES C(OCc1ccn2ncnc(Nc3ccc4n(Cc5ccccn5)ncc4c3)c12)[C@@H]1CNCCO1
InChI Key InChIKey=GZOONDSECSSONX-QFIPXVFZSA-N
Data  2 IC50
  Tab Delimited (TSV)   2D SDfile   Computed 3D by Vconf -m prep SDfile
Find this compound or compounds like it in BindingDB:
Activity Spreadsheet -- Enzyme Inhibition Constant Data from BindingDB
Found 2 hits for monomerid = 50204145
TargetEpidermal growth factor receptor(Homo sapiens (Human))
Bristol-Myers Squibb Pharmaceutical Research Institute
Curated by ChEMBL
LigandPNGBDBM50204145((S)-5-((morpholin-2-ylmethoxy)methyl)-N-(1-(pyridi...)
Affinity DataIC50:  500nM. Assay description: Inhibition of EGFR
In DepthDetails ArticlePubMed
TargetReceptor tyrosine-protein kinase erbB-2(Homo sapiens (Human))
Bristol-Myers Squibb Pharmaceutical Research Institute
Curated by ChEMBL
LigandPNGBDBM50204145((S)-5-((morpholin-2-ylmethoxy)methyl)-N-(1-(pyridi...)
Affinity DataIC50:  380nM. Assay description: Inhibition of human recombinant cytoplasmic HER2 kinase expressed in Sf9 cells
In DepthDetails ArticlePubMed