BDBM50204211 CHEMBL3944457
SMILES CCCCCCCCNC(=S)N1[C@H](CO)[C@@H](O)[C@H](O)[C@H]1CO
InChI Key InChIKey=XNRSYFIJRFLOFG-AAVRWANBSA-N
Data  1 IC50
  Tab Delimited (TSV)   2D SDfile   Computed 3D by Vconf -m prep SDfile
Find this compound or compounds like it in BindingDB:
Activity Spreadsheet -- Enzyme Inhibition Constant Data from BindingDB
Found 1 hit for monomerid = 50204211
TargetBeta-galactosidase(Bos taurus (Bovine))
University Of Toyama
Curated by ChEMBL
LigandPNGBDBM50204211(CHEMBL3944457)
Affinity DataIC50:  4.14E+5nM. Assay description: Inhibition of bovine liver beta-galactosidase using p-nitrophenyl-glycoside as substrate by spectrophotometric method
In DepthDetails ArticlePubMed