BDBM50204289 CHEMBL3892927::US20230295171, Example 13
SMILES Cc1cccc(Nc2nc(N[C@@H]3CCCC[C@@H]3N)cc3CNC(=O)c23)c1
InChI Key InChIKey=UITJPHZNGQVUHM-JKSUJKDBSA-N
Data  2 IC50  1 EC50
  Tab Delimited (TSV)   2D SDfile   Computed 3D by Vconf -m prep SDfile
Find this compound or compounds like it in BindingDB:
Activity Spreadsheet -- Enzyme Inhibition Constant Data from BindingDB
Found 3 hits for monomerid = 50204289
TargetTyrosine-protein kinase SYK(Homo sapiens (Human))
Takeda California
Curated by ChEMBL
LigandPNGBDBM50204289(CHEMBL3892927 | US20230295171, Example 13)
Affinity DataEC50:  5nM. Assay description: Inhibition of SYK in TgM-stimulated human Ramos cells expressing RA1/GFP-tagged BLNK assessed as reduction in RA1/GFP-tagged BLNK phosphorylation pre...
In DepthDetails ArticlePubMed
TargetTyrosine-protein kinase SYK(Homo sapiens (Human))
Takeda California
Curated by ChEMBL
LigandPNGBDBM50204289(CHEMBL3892927 | US20230295171, Example 13)
Affinity DataIC50:  2nM. Assay description: YK protein is prepared from cDNA encoding human spleen tyrosine kinase and is expressed in insect cells using a baculovirus expression vector. The cD...
In DepthDetails US Patent
TargetTyrosine-protein kinase SYK(Homo sapiens (Human))
Takeda California
Curated by ChEMBL
LigandPNGBDBM50204289(CHEMBL3892927 | US20230295171, Example 13)
Affinity DataIC50:  4.70nM. Assay description: Inhibition of human C-terminal 6His-tagged SYK (356 to 635 residues) expressed in Sf9 insect cells using 5-carboxyfluorescein(FAM)-EEPLYWSFPAKKK-NH2 ...
In DepthDetails ArticlePubMed