BDBM50204342 (2S)-2-[(2S)-2-[(2S,3R)-2-[(2S,3R)-2-[(2S)-5-carbamimidamido-2-{[(2S)-1-[(2S)-5-carbamimidamido-2-(2-acetamidoacetamido)pentanoyl]pyrrolidin-2-yl]formamido}pentanamido]-3-hydroxybutanamido]-3-hydroxybutanamido]propanamido]-3-phenylpropanoic acid::CHEMBL245918
SMILES [#6]-[#6@@H](-[#8])-[#6@H](-[#7]-[#6](=O)-[#6@H](-[#6]-[#6]-[#6]\[#7]=[#6](\[#7])-[#7])-[#7]-[#6](=O)-[#6@@H]-1-[#6]-[#6]-[#6]-[#7]-1-[#6](=O)-[#6@H](-[#6]-[#6]-[#6]\[#7]=[#6](\[#7])-[#7])-[#7]-[#6](=O)-[#6]-[#7]-[#6](-[#6])=O)-[#6](=O)-[#7]-[#6@@H](-[#6@@H](-[#6])-[#8])-[#6](=O)-[#7]-[#6@@H](-[#6])-[#6](=O)-[#7]-[#6@@H](-[#6]-c1ccccc1)-[#6](-[#8])=O
InChI Key InChIKey=VPBFFTBINAANIU-ULLXEEPRSA-N
Data  1 IC50
  Tab Delimited (TSV)   2D SDfile   Computed 3D by Vconf -m prep SDfile
Find this compound or compounds like it in BindingDB:
Activity Spreadsheet -- Enzyme Inhibition Constant Data from BindingDB
Found 1 hit for monomerid = 50204342
TargetRAC-alpha serine/threonine-protein kinase(Homo sapiens (Human))
Yale University
Curated by ChEMBL
LigandPNGBDBM50204342((2S)-2-[(2S)-2-[(2S,3R)-2-[(2S,3R)-2-[(2S)-5-carba...)
Affinity DataIC50:  4.09E+5nM. Assay description: Inhibition of Akt after 1 hr by fluorescence polarization assay
In DepthDetails ArticlePubMed