BDBM50204346 (2S)-N-(4-{[(1S)-1-{[(1S)-1-{[2-(4-benzylpiperidin-1-yl)ethyl]carbamoyl}-2-phenylethyl]carbamoyl}-2-methylpropyl]carbamoyl}phenyl)-5-carbamimidamido-2-{[(2S)-1-[(2S)-5-carbamimidamido-2-(2-acetamidoacetamido)pentanoyl]pyrrolidin-2-yl]formamido}pentanamide::CHEMBL437188
SMILES [#6]-[#6](-[#6])-[#6@H](-[#7]-[#6](=O)-c1ccc(-[#7]-[#6](=O)-[#6@H](-[#6]-[#6]-[#6]\[#7]=[#6](\[#7])-[#7])-[#7]-[#6](=O)-[#6@@H]-2-[#6]-[#6]-[#6]-[#7]-2-[#6](=O)-[#6@H](-[#6]-[#6]-[#6]\[#7]=[#6](\[#7])-[#7])-[#7]-[#6](=O)-[#6]-[#7]-[#6](-[#6])=O)cc1)-[#6](=O)-[#7]-[#6@@H](-[#6]-c1ccccc1)-[#6](=O)-[#7]-[#6]-[#6]-[#7]-1-[#6]-[#6]-[#6](-[#6]-c2ccccc2)-[#6]-[#6]-1
InChI Key InChIKey=HRAKFMJOMYDSFK-AYZRZDBESA-N
Data  1 IC50
  Tab Delimited (TSV)   2D SDfile   Computed 3D by Vconf -m prep SDfile
Find this compound or compounds like it in BindingDB:
Activity Spreadsheet -- Enzyme Inhibition Constant Data from BindingDB
Found 1 hit for monomerid = 50204346
TargetRAC-alpha serine/threonine-protein kinase(Homo sapiens (Human))
Yale University
Curated by ChEMBL
LigandPNGBDBM50204346((2S)-N-(4-{[(1S)-1-{[(1S)-1-{[2-(4-benzylpiperidin...)
Affinity DataIC50:  9.40E+4nM. Assay description: Inhibition of Akt after 1 hr by fluorescence polarization assay
In DepthDetails ArticlePubMed