BDBM50204352 (2S)-5-carbamimidamido-2-acetamido-N-(4-{[(1S)-2-methyl-1-{[(1S)-1-{[(4-pentylphenyl)methyl]carbamoyl}-2-phenylethyl]carbamoyl}propyl]carbamoyl}phenyl)pentanamide::CHEMBL394250
SMILES [#6]-[#6]-[#6]-[#6]-[#6]-c1ccc(-[#6]-[#7]-[#6](=O)-[#6@H](-[#6]-c2ccccc2)-[#7]-[#6](=O)-[#6@@H](-[#7]-[#6](=O)-c2ccc(-[#7]-[#6](=O)-[#6@H](-[#6]-[#6]-[#6]\[#7]=[#6](\[#7])-[#7])-[#7]-[#6](-[#6])=O)cc2)-[#6](-[#6])-[#6])cc1
InChI Key InChIKey=UKVRCSULBYFPSJ-KVBYWJEESA-N
Data  1 IC50
  Tab Delimited (TSV)   2D SDfile   Computed 3D by Vconf -m prep SDfile
Find this compound or compounds like it in BindingDB:
Activity Spreadsheet -- Enzyme Inhibition Constant Data from BindingDB
Found 1 hit for monomerid = 50204352
TargetRAC-alpha serine/threonine-protein kinase(Homo sapiens (Human))
Yale University
Curated by ChEMBL
LigandPNGBDBM50204352((2S)-5-carbamimidamido-2-acetamido-N-(4-{[(1S)-2-m...)
Affinity DataIC50:  1.04E+5nM. Assay description: Inhibition of Akt after 1 hr by fluorescence polarization assay
In DepthDetails ArticlePubMed