BDBM50204540 CHEMBL3907105
SMILES CCC(C)c1ccc(OCCOc2c(Cl)cc(Cl)cc2\C=N\n2cnnc2)cc1
InChI Key InChIKey=ZRJJEOLWVAPPKB-RPPGKUMJSA-N
Data  1 IC50
  Tab Delimited (TSV)   2D SDfile   Computed 3D by Vconf -m prep SDfile
Find this compound or compounds like it in BindingDB:
Activity Spreadsheet -- Enzyme Inhibition Constant Data from BindingDB
Found 1 hit for monomerid = 50204540
TargetCalcium release-activated calcium channel protein 1(Homo sapiens (Human))
The University Of Queensland
Curated by ChEMBL
LigandPNGBDBM50204540(CHEMBL3907105)
Affinity DataIC50:  6.99E+4nM. Assay description: Inhibition of Orai1-mediated store operated Ca2+ entry in human MDA-MB-231 cells assessed as reduction in BAPTA-induced Ca2+ depletion-stimulated SOC...
In DepthDetails ArticlePubMed