BDBM50204544 CHEMBL262766
SMILES Cc1nnsc1C(=O)Nc1ccc(cc1)-n1nc(cc1C(F)(F)F)C(F)(F)F
InChI Key InChIKey=XPRZIORDEVHURQ-UHFFFAOYSA-N
Data  4 IC50
  Tab Delimited (TSV)   2D SDfile   Computed 3D by Vconf -m prep SDfile
Find this compound or compounds like it in BindingDB:
Activity Spreadsheet -- Enzyme Inhibition Constant Data from BindingDB
Found 4 hits for monomerid = 50204544
TargetCalcium release-activated calcium channel protein 1(Homo sapiens (Human))
The University Of Queensland
Curated by ChEMBL
LigandPNGBDBM50204544(CHEMBL262766)
Affinity DataIC50:  2.80E+3nM. Assay description: Inhibition of Orai1-mediated store operated Ca2+ entry in human MDA-MB-231 cells assessed as reduction in BAPTA-induced Ca2+ depletion-stimulated SOC...
In DepthDetails ArticlePubMed
TargetShort transient receptor potential channel 5(Homo sapiens (Human))
University Of Nebraska Medical Center
Curated by ChEMBL
LigandPNGBDBM50204544(CHEMBL262766)
Affinity DataIC50:  300nM. Assay description: Inhibition of TRPC5 (unknown origin)
In DepthDetails ArticlePubMed
TargetCalcium release-activated calcium channel protein/Stromal interaction molecule 1(Rattus norvegicus)
University Of Nebraska Medical Center
Curated by ChEMBL
LigandPNGBDBM50204544(CHEMBL262766)
Affinity DataIC50:  590nM. Assay description: Inhibition of ORAI/STIM1 in thapsigargin treated rat RBL2H3 cells assessed as reduction in store-operated calcium entry after 5 mins by fura-2-AM dye...
In DepthDetails ArticlePubMed
TargetShort transient receptor potential channel 3(Homo sapiens (Human))
University Of Nebraska Medical Center
Curated by ChEMBL
LigandPNGBDBM50204544(CHEMBL262766)
Affinity DataIC50:  4.21E+3nM. Assay description: Inhibition of YFP-tagged TRPC3 (unknown origin) expressed in HEK293 cells assessed as reduction carbhocol-induced receptor operated Calcium influx af...
In DepthDetails ArticlePubMed