BDBM50205342 CHEMBL3962296
SMILES CCOc1ccc(cc1)S(=O)(=O)Nc1cc(CCCC(O)=O)c(NS(=O)(=O)c2ccc(OCC)cc2)c2ccccc12
InChI Key InChIKey=KVAYHZPJAGMVIR-UHFFFAOYSA-N
Data  1 IC50
  Tab Delimited (TSV)   2D SDfile   Computed 3D by Vconf -m prep SDfile
Find this compound or compounds like it in BindingDB:
Activity Spreadsheet -- Enzyme Inhibition Constant Data from BindingDB
Found 1 hit for monomerid = 50205342
TargetNuclear factor erythroid 2-related factor 2(Homo sapiens (Human))
Keio University
Curated by ChEMBL
LigandPNGBDBM50205342(CHEMBL3962296)
Affinity DataIC50:  150nM. Assay description: Inhibition of recombinant GST-His-tagged Keap1-DC domain (321 to 609 residues) (unknown origin) expressed in Escherichia coli/FAM-labeled Nrf2 (unkno...
In DepthDetails ArticlePubMed