BDBM50205502 CHEMBL3908085
SMILES COc1ccc(cc1)-c1nnn(CC(=O)Nc2ccc(cn2)-c2ccccc2)c1-c1ccccc1
InChI Key InChIKey=APGNKKYGKZSAHC-UHFFFAOYSA-N
Data  1 EC50
  Tab Delimited (TSV)   2D SDfile   Computed 3D by Vconf -m prep SDfile
Find this compound or compounds like it in BindingDB:
Activity Spreadsheet -- Enzyme Inhibition Constant Data from BindingDB
Found 1 hit for monomerid = 50205502
TargetProtein-serine O-palmitoleoyltransferase porcupine(Mus musculus)
Ut Southwestern Medical Center
Curated by ChEMBL
LigandPNGBDBM50205502(CHEMBL3908085)
Affinity DataEC50:  18nM. Assay description: Inhibition of porcupine-mediated Wnt signaling in mouse L-cells after 24 hrs by springerImage-Topflash reporter assay
In DepthDetails ArticlePubMed