BDBM50205503 CHEMBL3954145
SMILES O=C(Cn1nnc(c1-c1ccccc1)-c1ccncc1)Nc1ccc(cc1)-c1ccncc1
InChI Key InChIKey=CRCNHROWUZQCEZ-UHFFFAOYSA-N
Data  1 EC50
  Tab Delimited (TSV)   2D SDfile   Computed 3D by Vconf -m prep SDfile
Find this compound or compounds like it in BindingDB:
Activity Spreadsheet -- Enzyme Inhibition Constant Data from BindingDB
Found 1 hit for monomerid = 50205503
TargetProtein-serine O-palmitoleoyltransferase porcupine(Mus musculus)
Ut Southwestern Medical Center
Curated by ChEMBL
LigandPNGBDBM50205503(CHEMBL3954145)
Affinity DataEC50:  7nM. Assay description: Inhibition of porcupine-mediated Wnt signaling in mouse L-cells after 24 hrs by springerImage-Topflash reporter assay
In DepthDetails ArticlePubMed