BDBM50205558 CHEMBL3953544
SMILES O=C(Cn1nnc(c1-c1ccccc1)-c1ccncc1)Nc1ccc(cn1)-c1ccoc1
InChI Key InChIKey=FSTWBIHIDHYFEW-UHFFFAOYSA-N
Data  1 EC50
  Tab Delimited (TSV)   2D SDfile   Computed 3D by Vconf -m prep SDfile
Find this compound or compounds like it in BindingDB:
Activity Spreadsheet -- Enzyme Inhibition Constant Data from BindingDB
Found 1 hit for monomerid = 50205558
TargetProtein-serine O-palmitoleoyltransferase porcupine(Mus musculus)
Ut Southwestern Medical Center
Curated by ChEMBL
LigandPNGBDBM50205558(CHEMBL3953544)
Affinity DataEC50:  0.600nM. Assay description: Inhibition of porcupine-mediated Wnt signaling in mouse L-cells after 24 hrs by springerImage-Topflash reporter assay
In DepthDetails ArticlePubMed