BDBM50205756 1-((1-(2-(4-chlorobenzyloxy)-5-bromobenzyl)-4-hydroxypiperidin-4-yl)methyl)-3-(4-fluorophenyl)urea::CHEMBL238118
SMILES OC1(CNC(=O)Nc2ccc(F)cc2)CCN(Cc2cc(Br)ccc2OCc2ccc(Cl)cc2)CC1
InChI Key InChIKey=JXUFFSVTTKFZEJ-UHFFFAOYSA-N
Data  1 IC50
  Tab Delimited (TSV)   2D SDfile   Computed 3D by Vconf -m prep SDfile
Find this compound or compounds like it in BindingDB:
Activity Spreadsheet -- Enzyme Inhibition Constant Data from BindingDB
Found 1 hit for monomerid = 50205756
TargetC-C chemokine receptor type 5(Homo sapiens (Human))
Berlex Biosciences
Curated by ChEMBL
LigandPNGBDBM50205756(1-((1-(2-(4-chlorobenzyloxy)-5-bromobenzyl)-4-hydr...)
Affinity DataIC50:  1.50E+3nM. Assay description: Displacement of [125I]MIP1alpha from human CCR5 receptor expressed in HEK293 cells coexpressing CD4
In DepthDetails ArticlePubMed